SAP Knowledge Base Article - Preview

3147787 - Build failure when enabling the Integrations Pack on SAP Commerce Cloud

Symptom

The build in SAP Commerce Cloud fails with the following error:

Version 1811.CEP.03 is in wrong format, skipping
2022-01-08T12:30:36.698Z Task task ':prepareCoreCommerceWorkspace' finished

> Task :prepareCoreCommerceWorkspace FAILED
:prepareCoreCommerceWorkspace (Thread[Execution worker for ':',5,main]) completed. Took 4 mins 50.881 secs.

FAILURE: Build failed with an exception.

* What went wrong:
Execution failed for task ':prepareCoreCommerceWorkspace'.
> No value present

* Try:
Run with --debug option to get more log output. Run with --scan to get full insights.

* Exception is:
org.gradle.api.tasks.TaskExecutionException: Execution failed for task ':prepareCoreCommerceWorkspace'.
 at org.gradle.api.internal.tasks.execution.ExecuteActionsTaskExecuter.lambda$executeIfValid$3(ExecuteActionsTaskExecuter.java:186)
 at org.gradle.internal.Try$Failure.ifSuccessfulOrElse(Try.java:268)
 at org.gradle.api.internal.tasks.execution.ExecuteActionsTaskExecuter.executeIfValid(ExecuteActionsTaskExecuter.java:184)


Read more...

Environment

SAP Commerce Cloud

Product

SAP Commerce Cloud 2005 ; SAP Commerce, integration extension pack 2005

Keywords

Extension Pack, Integration Pack, Integration Extension Pack, CEP , KBA , CEC-HCS-CCAZ-BUILD , Environment builds , CEC-COM-ODS , O-Data Services, Integration to SCPI , Problem

About this page

This is a preview of a SAP Knowledge Base Article. Click more to access the full version on SAP for Me (Login required).

Search for additional results

Visit SAP Support Portal's SAP Notes and KBA Search.